Target
Coagulation factor X
Ligand
BDBM50266891
Substrate
Meas. Tech.
ChEMBL_563985 (CHEMBL956028)
IC50
0.31±n/a nM
Citation
 Van Huis, CACasimiro-Garcia, ABigge, CFCody, WLDudley, DAFilipski, KJHeemstra, RJKohrt, JTLeadley, RJNarasimhan, LSMcClanahan, TMochalkin, IPamment, MPeterson, JTSahasrabudhe, VSchaum, RPEdmunds, JJ Exploration of 4,4-disubstituted pyrrolidine-1,2-dicarboxamides as potent, orally active Factor Xa inhibitors with extended duration of action. Bioorg Med Chem 17:2501-11 (2009)  
Target
Name:
Coagulation factor X
Synonyms:
Activated coagulation factor X (FXa) Coagulation factor X precursor F10 Factor X heavy chain Factor Xa Stuart-Prower factor
Type:
Enzyme
Mol. Mass.:
54726.60
Organism:
Homo sapiens (Human)
Description:
Residue:
488
  
Inhibitor
Name:
BDBM50266891
Synonyms:
(2R,4R)-N1-(4-Chlorophenyl)-N2-(2-fluoro-4-(2-oxopyridin-1(2H)-yl)phenyl)-4-methoxy-4-methylpyrrolidine-1,2-dicarboxamide | CHEMBL477229
Type:
Small organic molecule
Emp. Form.:
C25H24ClFN4O4
Mol. Mass.:
498.934
SMILES:
CO[C@]1(C)C[C@@H](N(C1)C(=O)Nc1ccc(Cl)cc1)C(=O)Nc1ccc(cc1F)-n1ccccc1=O
: