Target
Coagulation factor X
Ligand
BDBM50266773
Substrate
Meas. Tech.
ChEMBL_563985 (CHEMBL956028)
IC50
0.11±n/a nM
Citation
 Van Huis, CACasimiro-Garcia, ABigge, CFCody, WLDudley, DAFilipski, KJHeemstra, RJKohrt, JTLeadley, RJNarasimhan, LSMcClanahan, TMochalkin, IPamment, MPeterson, JTSahasrabudhe, VSchaum, RPEdmunds, JJ Exploration of 4,4-disubstituted pyrrolidine-1,2-dicarboxamides as potent, orally active Factor Xa inhibitors with extended duration of action. Bioorg Med Chem 17:2501-11 (2009)  
Target
Name:
Coagulation factor X
Synonyms:
Activated coagulation factor X (FXa) Coagulation factor X precursor F10 Factor X heavy chain Factor Xa Stuart-Prower factor
Type:
Enzyme
Mol. Mass.:
54726.60
Organism:
Homo sapiens (Human)
Description:
Residue:
488
  
Inhibitor
Name:
BDBM50266773
Synonyms:
(2R,4S)-N1-(4-Chlorophenyl)-4-hydroxy-N2-(5-(2-oxopyridin-1(2H)-yl)pyridin-2-yl)-4-o-tolylpyrrolidine-1,2-dicarboxamide | CHEMBL514510
Type:
Small organic molecule
Emp. Form.:
C29H26ClN5O4
Mol. Mass.:
544.001
SMILES:
Cc1ccccc1[C@@]1(O)C[C@@H](N(C1)C(=O)Nc1ccc(Cl)cc1)C(=O)Nc1ccc(cn1)-n1ccccc1=O
: