Target
Acetylcholinesterase
Ligand
BDBM50279997
Substrate
Meas. Tech.
ChEBML_28154
IC50
429±n/a nM
Citation
 Desai, MCThadeio, PFLipinski, CAListon, DRSpencer, RWWilliams, IH Physical parameters for brian uptake: optimizing log P, log D and pKa of T H A Bioorg Med Chem Lett 1:411-414 (1991)    Article 
Target
Name:
Acetylcholinesterase
Synonyms:
ACES_HUMAN Acetylcholinesterase (AChE) | Acetylcholinesterase (human AChE)
Type:
Enzyme
Mol. Mass.:
67792.70
Organism:
Homo sapiens (Human)
Description:
P22303
Residue:
614
  
Inhibitor
Name:
BDBM50279997
Synonyms:
6,7,8,9-Tetrahydro-benzo[b][1,8]naphthyridin-5-ylamine | CHEMBL133448
Type:
Small organic molecule
Emp. Form.:
C12H13N3
Mol. Mass.:
199.2517
SMILES:
Nc1c2CCCCc2nc2ncccc12
: