Target
Histamine H1 receptor
Ligand
BDBM50284690
Substrate
Meas. Tech.
ChEBML_84869
IC50
>10000±n/a nM
Citation
 Marfat, AChambers, RCheng, JCooper, KDamon, DDelehunt, JEggler, JMasamune, HMelvin, LWatson, J The discovery of CP-96,021 and CP-96,486, balanced, combined, potent and orally active leukotriene D4 (LTD4)/platelet activating factor (PAF) receptor antagonists. Bioorg Med Chem Lett 5:1377-1382 (1995)    Article 
Target
Name:
Histamine H1 receptor
Synonyms:
H1R HISTAMINE H1 HRH1_HUMAN
Type:
G Protein-Coupled Receptor (GPCR)
Mol. Mass.:
55808.72
Organism:
Homo sapiens (Human)
Description:
Cell pellets from SK-N-MC cells transfected with human H1 receptor were used in binding assay.
Residue:
487
  
Inhibitor
Name:
BDBM50284690
Synonyms:
1-(4-{3-[(E)-2-(5-Fluoro-benzothiazol-2-yl)-vinyl]-benzyloxy}-phenyl)-2-methyl-1H-imidazo[4,5-c]pyridine CP-96021
Type:
Small organic molecule
Emp. Form.:
C29H21FN4OS
Mol. Mass.:
492.567
SMILES:
Cc1nc2cnccc2n1-c1ccc(OCc2cccc(\C=C\c3nc4cc(F)ccc4s3)c2)cc1
: