Target
Neuronal acetylcholine receptor subunit alpha-10
Ligand
BDBM50287850
Substrate
Meas. Tech.
ChEBML_143222
Ki
175±n/a nM
Citation
 Elliott, RLKopecka, HGunn, DELin, NHGarvey, DSRyther, KBHolladay, MWAnderson, DJCampbell, JESullivan, JPBuckley, MJGunther, KLO'Neill, ABDecker, MWArnerić, SP 2-(Aryloxymethyl) azacyclic analogues as novel nicotinic acetylcholine receptor (nAChR) ligands Bioorg Med Chem Lett 6:2283-2288 (1996)    Article 
Target
Name:
Neuronal acetylcholine receptor subunit alpha-10
Synonyms:
ACH10_RAT Neuronal acetylcholine receptor protein alpha-10 subunit | Nicotinic acetylcholine receptor alpha9/alpha10
Type:
PROTEIN
Mol. Mass.:
49830.54
Organism:
Rattus norvegicus
Description:
ChEMBL_143222
Residue:
447
  
Inhibitor
Name:
BDBM50287850
Synonyms:
(S)-2-(3-Methoxy-phenoxymethyl)-1-methyl-pyrrolidine | CHEMBL305820
Type:
Small organic molecule
Emp. Form.:
C13H19NO2
Mol. Mass.:
221.2955
SMILES:
COc1cccc(OC[C@@H]2CCCN2C)c1
: