Target
Nitric oxide synthase, inducible
Ligand
BDBM50290810
Substrate
Meas. Tech.
ChEBML_89183
IC50
9900±n/a nM
Citation
 Shankaran, KDonnelly, KLShah, SKHumes, JLPacholok, SGGrant, SKGreen, BGMacCoss, M Inhibition of nitric oxide synthase by benzoxazolones Bioorg Med Chem Lett 7:2887-2892 (1997)    Article 
Target
Name:
Nitric oxide synthase, inducible
Synonyms:
HEP-NOS Inducible NO synthase NOS type II NOS2A Nitric oxide synthase, inducible (iNOS) | iNOS
Type:
Homodimer
Mol. Mass.:
131141.95
Organism:
Homo sapiens (Human)
Description:
P35228
Residue:
1153
  
Inhibitor
Name:
BDBM50290810
Synonyms:
5-Methyl-3H-benzooxazol-2-one | CHEMBL101439
Type:
Small organic molecule
Emp. Form.:
C8H7NO2
Mol. Mass.:
149.1467
SMILES:
Cc1ccc2oc(=O)[nH]c2c1
: