Target
Vasopressin V1a/V1b receptor
Ligand
BDBM35667
Substrate
Meas. Tech.
ChEMBL_211080 (CHEMBL812861)
IC50
10±n/a nM
Citation
 Moutiez, MLippens, GSergheraert, CTartar, A Vasopressin trisulphide: synthesis, NMR study and affinity studies with V1 and V2 subtypes receptors Bioorg Med Chem Lett 7:719-724 (1997)    Article 
Target
Name:
Vasopressin V1a/V1b receptor
Synonyms:
Vasopressin V1 receptor
Type:
Mol. Mass.:
Description:
ASSAY_ID of ChEMBL is 214265
Components:
This complex has 2 components.
Component 1
Name:
Vasopressin V1a receptor
Synonyms:
Avpr1a VASOPRESSIN V1A Vasopressin V1a receptor | Vasopressin receptor
Type:
Enzyme Catalytic Domain
Mol. Mass.:
47674.81
Organism:
RAT
Description:
VASOPRESSIN V1A AVPR1A RAT::P30560
Residue:
424
  
Component 2
Name:
Vasopressin V1b receptor
Synonyms:
Avpr1b VASOPRESSIN V1B Vasopressin receptor
Type:
Enzyme Catalytic Domain
Mol. Mass.:
47104.48
Organism:
RAT
Description:
VASOPRESSIN V1B AVPR1B RAT::P48974
Residue:
425
  
Inhibitor
Name:
BDBM35667
Synonyms:
AVP US10131692, 44 (AVP) [3H]Argipressin tannate | [3H]vasopressin
Type:
radiolabeled ligand
Emp. Form.:
C46H65N15O12S2
Mol. Mass.:
1084.232
SMILES:
[#7]-[#6@H]-1-[#6]-[#16]-[#16]-[#6]-[#6@H](-[#7]-[#6](=O)-[#6@H](-[#6]-[#6](-[#7])=O)-[#7]-[#6](=O)-[#6@H](-[#6]-[#6]-[#6](-[#7])=O)-[#7]-[#6](=O)-[#6@H](-[#6]-c2ccccc2)-[#7]-[#6](=O)-[#6@H](-[#6]-c2ccc(-[#8])cc2)-[#7]-[#6]-1=O)-[#6](=O)-[#7]-1-[#6]-[#6]-[#6]-[#6@H]-1-[#6](=O)-[#7]-[#6@@H](-[#6]-[#6]-[#6]\[#7]=[#6](\[#7])-[#7])-[#6](=O)-[#7]-[#6]-[#6](-[#7])=O
: