Target
Leukotriene A-4 hydrolase
Ligand
BDBM50294171
Substrate
Meas. Tech.
ChEMBL_571718 (CHEMBL1032963)
IC50
1077000±n/a nM
Citation
 Davies, DRMamat, BMagnusson, OTChristensen, JHaraldsson, MHMishra, RPease, BHansen, ESingh, JZembower, DKim, HKiselyov, ASBurgin, ABGurney, MEStewart, LJ Discovery of leukotriene A4 hydrolase inhibitors using metabolomics biased fragment crystallography. J Med Chem 52:4694-715 (2009)  
Target
Name:
Leukotriene A-4 hydrolase
Synonyms:
LKHA4_HUMAN LTA4 Leukotriene A(4) hydrolase Leukotriene A4 hydrolase
Type:
Hydrolase; metalloprotease
Mol. Mass.:
69280.41
Organism:
Homo sapiens (Human)
Description:
Human recombinant LTA4H.
Residue:
611
  
Inhibitor
Name:
BDBM50294171
Synonyms:
CHEMBL549343 N-methyl-1-(2-thiophen-2-ylphenyl)methanamine
Type:
Small organic molecule
Emp. Form.:
C12H13NS
Mol. Mass.:
203.303
SMILES:
CNCc1ccccc1-c1cccs1
: