Target
Leukotriene A-4 hydrolase
Ligand
BDBM50294163
Substrate
Meas. Tech.
ChEMBL_571718 (CHEMBL1032963)
IC50
207±n/a nM
Citation
 Davies, DRMamat, BMagnusson, OTChristensen, JHaraldsson, MHMishra, RPease, BHansen, ESingh, JZembower, DKim, HKiselyov, ASBurgin, ABGurney, MEStewart, LJ Discovery of leukotriene A4 hydrolase inhibitors using metabolomics biased fragment crystallography. J Med Chem 52:4694-715 (2009)  
Target
Name:
Leukotriene A-4 hydrolase
Synonyms:
LKHA4_HUMAN LTA4 Leukotriene A(4) hydrolase Leukotriene A4 hydrolase
Type:
Hydrolase; metalloprotease
Mol. Mass.:
69280.41
Organism:
Homo sapiens (Human)
Description:
Human recombinant LTA4H.
Residue:
611
  
Inhibitor
Name:
BDBM50294163
Synonyms:
(R)-N-benzyl-4-(pyrrolidin-2-ylmethoxy)aniline N-benzyl-4-[(2R)-pyrrolidin-2-ylmethoxy]aniline
Type:
Small organic molecule
Emp. Form.:
C18H22N2O
Mol. Mass.:
282.3801
SMILES:
C(Nc1ccc(OC[C@H]2CCCN2)cc1)c1ccccc1
: