Target
Leukotriene A-4 hydrolase
Ligand
BDBM32212
Substrate
Meas. Tech.
ChEMBL_571718 (CHEMBL1032963)
IC50
>1000000±n/a nM
Citation
 Davies, DRMamat, BMagnusson, OTChristensen, JHaraldsson, MHMishra, RPease, BHansen, ESingh, JZembower, DKim, HKiselyov, ASBurgin, ABGurney, MEStewart, LJ Discovery of leukotriene A4 hydrolase inhibitors using metabolomics biased fragment crystallography. J Med Chem 52:4694-715 (2009)  
Target
Name:
Leukotriene A-4 hydrolase
Synonyms:
LKHA4_HUMAN LTA4 Leukotriene A(4) hydrolase Leukotriene A4 hydrolase
Type:
Hydrolase; metalloprotease
Mol. Mass.:
69280.41
Organism:
Homo sapiens (Human)
Description:
Human recombinant LTA4H.
Residue:
611
  
Inhibitor
Name:
BDBM32212
Synonyms:
1H-indol-5-ol | cid_16054
Type:
Small organic molecule
Emp. Form.:
C8H7NO
Mol. Mass.:
133.1473
SMILES:
Oc1ccc2[nH]ccc2c1
: