Target
Leukotriene A-4 hydrolase
Ligand
BDBM50294164
Substrate
Meas. Tech.
ChEMBL_571718 (CHEMBL1032963)
IC50
38900±n/a nM
Citation
 Davies, DRMamat, BMagnusson, OTChristensen, JHaraldsson, MHMishra, RPease, BHansen, ESingh, JZembower, DKim, HKiselyov, ASBurgin, ABGurney, MEStewart, LJ Discovery of leukotriene A4 hydrolase inhibitors using metabolomics biased fragment crystallography. J Med Chem 52:4694-715 (2009)  
Target
Name:
Leukotriene A-4 hydrolase
Synonyms:
LKHA4_HUMAN LTA4 Leukotriene A(4) hydrolase Leukotriene A4 hydrolase
Type:
Hydrolase; metalloprotease
Mol. Mass.:
69280.41
Organism:
Homo sapiens (Human)
Description:
Human recombinant LTA4H.
Residue:
611
  
Inhibitor
Name:
BDBM50294164
Synonyms:
1-(2,2'-bithiophen-5-yl)methanamine CHEMBL538940
Type:
Small organic molecule
Emp. Form.:
C9H9NS2
Mol. Mass.:
195.304
SMILES:
NCc1ccc(s1)-c1cccs1
: