Target
Leukotriene A-4 hydrolase
Ligand
BDBM50294165
Substrate
Meas. Tech.
ChEMBL_571719 (CHEMBL1032964)
IC50
106000±n/a nM
Citation
 Davies, DRMamat, BMagnusson, OTChristensen, JHaraldsson, MHMishra, RPease, BHansen, ESingh, JZembower, DKim, HKiselyov, ASBurgin, ABGurney, MEStewart, LJ Discovery of leukotriene A4 hydrolase inhibitors using metabolomics biased fragment crystallography. J Med Chem 52:4694-715 (2009)  
Target
Name:
Leukotriene A-4 hydrolase
Synonyms:
LKHA4_HUMAN LTA4 Leukotriene A(4) hydrolase Leukotriene A4 hydrolase
Type:
Hydrolase; metalloprotease
Mol. Mass.:
69280.41
Organism:
Homo sapiens (Human)
Description:
Human recombinant LTA4H.
Residue:
611
  
Inhibitor
Name:
BDBM50294165
Synonyms:
(4-(thiophen-2-yl)phenyl)methanamine CHEMBL539640
Type:
Small organic molecule
Emp. Form.:
C11H11NS
Mol. Mass.:
189.277
SMILES:
NCc1ccc(cc1)-c1cccs1
: