Target
Mitogen-activated protein kinase 14
Ligand
BDBM50297484
Substrate
Meas. Tech.
ChEMBL_586023 (CHEMBL1063580)
Ki
3400±n/a nM
Citation
 Cao, JGao, HBemis, GSalituro, FLedeboer, MHarrington, EWilke, STaslimi, PPazhanisamy, SXie, XJacobs, MGreen, J Structure-based design and parallel synthesis of N-benzyl isatin oximes as JNK3 MAP kinase inhibitors. Bioorg Med Chem Lett 19:2891-5 (2009)  
Target
Name:
Mitogen-activated protein kinase 14
Synonyms:
CSAID-binding protein CSBP1 CSPB1 MAP kinase 14 MAP kinase p38 alpha MAPK14 MK14_HUMAN Mitogen-activated protein kinase p38 alpha Stress-activated protein kinase 2a | p38 MAP kinase alpha/beta
Type:
Serine/threonine-protein kinase
Mol. Mass.:
41286.76
Organism:
Homo sapiens (Human)
Description:
Q16539
Residue:
360
  
Inhibitor
Name:
BDBM50297484
Synonyms:
1-((6-fluoro-4H-benzo[d][1,3]dioxin-8-yl)methyl)-4-(4-fluorophenyl)-3-(hydroxyimino)indolin-2-one | CHEMBL564447
Type:
Small organic molecule
Emp. Form.:
C23H16F2N2O4
Mol. Mass.:
422.3809
SMILES:
Fc1ccc(cc1)-c1cccc2N(Cc3cc(F)cc4COCOc34)C(=O)C(N=O)c12
: