Target
Corticotropin-releasing factor receptor 1
Ligand
BDBM50300135
Substrate
Meas. Tech.
ChEMBL_593894 (CHEMBL1037787)
IC50
1.1±n/a nM
Citation
 Hartz, RAAhuja, VTZhuo, XMattson, RJDenhart, DJDeskus, JAVrudhula, VMPan, SDitta, JLShu, YZGrace, JELentz, KALelas, SLi, YWMolski, TFKrishnananthan, SWong, HQian-Cutrone, JSchartman, RDenton, RLodge, NJZaczek, RMacor, JEBronson, JJ A strategy to minimize reactive metabolite formation: discovery of (S)-4-(1-cyclopropyl-2-methoxyethyl)-6-[6-(difluoromethoxy)-2,5-dimethylpyridin-3-ylamino]-5-oxo-4,5-dihydropyrazine-2-carbonitrile as a potent, orally bioavailable corticotropin-releasing factor-1 receptor antagonist. J Med Chem 52:7653-68 (2009)  
Target
Name:
Corticotropin-releasing factor receptor 1
Synonyms:
CRF-R CRFR1_RAT Corticotropin releasing factor receptor Corticotropin-releasing Factor Receptor 1 Crhr | Crhr1
Type:
G Protein-Coupled Receptor (GPCR)
Mol. Mass.:
47870.75
Organism:
Rattus norvegicus (rat)
Description:
Receptor binding assays were performed using rat cortex homogenate.
Residue:
415
  
Inhibitor
Name:
BDBM50300135
Synonyms:
(R)-5-Chloro-1-(1-cyclopropyl-2-methoxyethyl)-3-(6-methoxy-2,5-dimethylpyridin-3-ylamino)pyrazin-2(1H)-one | CHEMBL575491
Type:
Small organic molecule
Emp. Form.:
C18H23ClN4O3
Mol. Mass.:
378.853
SMILES:
COC[C@@H](C1CC1)n1cc(Cl)nc(Nc2cc(C)c(OC)nc2C)c1=O
: