Target
Leukotriene A-4 hydrolase
Ligand
BDBM50303653
Substrate
Meas. Tech.
ChEMBL_596627 (CHEMBL1046154)
IC50
8700±n/a nM
Citation
 Sandanayaka, VMamat, BMishra, RKWinger, JKrohn, MZhou, LMKeyvan, MEnache, LSullins, DOnua, EZhang, JHalldorsdottir, GSigthorsdottir, HThorlaksdottir, ASigthorsson, GThorsteinnsdottir, MDavies, DRStewart, LJZembower, DEAndresson, TKiselyov, ASSingh, JGurney, ME Discovery of 4-[(2S)-2-{[4-(4-chlorophenoxy)phenoxy]methyl}-1-pyrrolidinyl]butanoic acid (DG-051) as a novel leukotriene A4 hydrolase inhibitor of leukotriene B4 biosynthesis. J Med Chem 53:573-85 (2010)  
Target
Name:
Leukotriene A-4 hydrolase
Synonyms:
LKHA4_HUMAN LTA4 Leukotriene A(4) hydrolase Leukotriene A4 hydrolase
Type:
Hydrolase; metalloprotease
Mol. Mass.:
69280.41
Organism:
Homo sapiens (Human)
Description:
Human recombinant LTA4H.
Residue:
611
  
Inhibitor
Name:
BDBM50303653
Synonyms:
4-[2-(4-Benzylphenoxy)ethyl]pyridine | CHEMBL578131
Type:
Small organic molecule
Emp. Form.:
C20H19NO
Mol. Mass.:
289.371
SMILES:
C(Cc1ccncc1)Oc1ccc(Cc2ccccc2)cc1
: