Target
Botulinum neurotoxin type A
Ligand
BDBM23289
Substrate
Meas. Tech.
ChEMBL_606599 (CHEMBL1069850)
IC50
800±n/a nM
Citation
 Capková, KHixon, MSPellett, SBarbieri, JTJohnson, EAJanda, KD Benzylidene cyclopentenediones: First irreversible inhibitors against botulinum neurotoxin A's zinc endopeptidase. Bioorg Med Chem Lett 20:206-8 (2010)  
Target
Name:
Botulinum neurotoxin type A
Synonyms:
BXA1_CLOBO bonT | botA
Type:
PROTEIN
Mol. Mass.:
149450.01
Organism:
Clostridium botulinum
Description:
ChEMBL_1510137
Residue:
1296
  
Inhibitor
Name:
BDBM23289
Synonyms:
(2E)-3-(4-chloro-2-methylphenyl)-N-hydroxyprop-2-enamide | hydroxamate derivative, 5f
Type:
Small organic molecule
Emp. Form.:
C10H10ClNO2
Mol. Mass.:
211.645
SMILES:
Cc1cc(Cl)ccc1\C=C\C(=O)NO
: