Target
Botulinum neurotoxin type A
Ligand
BDBM50304909
Substrate
Meas. Tech.
ChEMBL_606599 (CHEMBL1069850)
IC50
41000±n/a nM
Citation
 Capková, KHixon, MSPellett, SBarbieri, JTJohnson, EAJanda, KD Benzylidene cyclopentenediones: First irreversible inhibitors against botulinum neurotoxin A's zinc endopeptidase. Bioorg Med Chem Lett 20:206-8 (2010)  
Target
Name:
Botulinum neurotoxin type A
Synonyms:
BXA1_CLOBO bonT | botA
Type:
PROTEIN
Mol. Mass.:
149450.01
Organism:
Clostridium botulinum
Description:
ChEMBL_1510137
Residue:
1296
  
Inhibitor
Name:
BDBM50304909
Synonyms:
CHEMBL593815 | N-hydroxy-4-pentylbenzamide
Type:
Small organic molecule
Emp. Form.:
C12H17NO2
Mol. Mass.:
207.2689
SMILES:
CCCCCc1ccc(cc1)C(=O)NO
: