Target
Botulinum neurotoxin type A
Ligand
BDBM50304910
Substrate
Meas. Tech.
ChEMBL_606604 (CHEMBL1071240)
IC50
600000±n/a nM
Citation
 Capková, KHixon, MSPellett, SBarbieri, JTJohnson, EAJanda, KD Benzylidene cyclopentenediones: First irreversible inhibitors against botulinum neurotoxin A's zinc endopeptidase. Bioorg Med Chem Lett 20:206-8 (2010)  
Target
Name:
Botulinum neurotoxin type A
Synonyms:
BXA1_CLOBO bonT | botA
Type:
PROTEIN
Mol. Mass.:
149450.01
Organism:
Clostridium botulinum
Description:
ChEMBL_1510137
Residue:
1296
  
Inhibitor
Name:
BDBM50304910
Synonyms:
2-(2,4-dichlorobenzylidene)cyclopent-4-ene-1,3-dione | CHEMBL610755
Type:
Small organic molecule
Emp. Form.:
C12H6Cl2O2
Mol. Mass.:
253.081
SMILES:
Clc1ccc(\[#6]=[#6]-2\[#6](=O)-[#6]=[#6]-[#6]-2=O)c(Cl)c1
: