Target
Botulinum neurotoxin type A
Ligand
BDBM50304911
Substrate
Meas. Tech.
ChEMBL_606606 (CHEMBL1071242)
IC50
125000±n/a nM
Citation
 Capková, KHixon, MSPellett, SBarbieri, JTJohnson, EAJanda, KD Benzylidene cyclopentenediones: First irreversible inhibitors against botulinum neurotoxin A's zinc endopeptidase. Bioorg Med Chem Lett 20:206-8 (2010)  
Target
Name:
Botulinum neurotoxin type A
Synonyms:
BXA1_CLOBO bonT | botA
Type:
PROTEIN
Mol. Mass.:
149450.01
Organism:
Clostridium botulinum
Description:
ChEMBL_1510137
Residue:
1296
  
Inhibitor
Name:
BDBM50304911
Synonyms:
1-(2,4-dichlorobenzyl)-1H-pyrrole-2,5-dione | CHEMBL592938
Type:
Small organic molecule
Emp. Form.:
C11H7Cl2NO2
Mol. Mass.:
256.085
SMILES:
Clc1ccc(CN2C(=O)C=CC2=O)c(Cl)c1
: