Target
Sodium-dependent dopamine transporter
Ligand
BDBM50309520
Substrate
Meas. Tech.
ChEMBL_609534 (CHEMBL1073787)
Ki
>6630±n/a nM
Citation
 Dounay, ABBarta, NSCampbell, BMColeman, CCollantes, EMDenny, LDutta, SGray, DLHou, DIyer, RMaiti, SNOrtwine, DFProbert, AStratman, NCSubedi, RWhisman, TXu, WZoski, K Design, synthesis, and pharmacological evaluation of phenoxy pyridyl derivatives as dual norepinephrine reuptake inhibitors and 5-HT1A partial agonists. Bioorg Med Chem Lett 20:1114-7 (2010)  
Target
Name:
Sodium-dependent dopamine transporter
Synonyms:
DA transporter DAT1 Dopamine transporter protein (DAT) SC6A3_HUMAN Sodium-dependent dopamine transporter Solute carrier family 6 member 3
Type:
Multi-pass membrane protein
Mol. Mass.:
68497.11
Organism:
Homo sapiens (Human)
Description:
Q01959
Residue:
620
  
Inhibitor
Name:
BDBM50309520
Synonyms:
2-(2,6-difluorophenoxy)-3-(piperidin-4-yl)pyridine | CHEMBL597135
Type:
Small organic molecule
Emp. Form.:
C16H16F2N2O
Mol. Mass.:
290.3078
SMILES:
Fc1cccc(F)c1Oc1ncccc1C1CCNCC1
: