Target
Antithrombin-III
Ligand
BDBM50310300
Substrate
Meas. Tech.
ChEMBL_607976 (CHEMBL1072392)
IC50
>3000000±n/a nM
Citation
 El-Ayache, NCLi, SHWarnock, MLawrence, DAEmal, CD Novel bis-arylsulfonamides and aryl sulfonimides as inactivators of plasminogen activator inhibitor-1 (PAI-1). Bioorg Med Chem Lett 20:966-70 (2010)  
Target
Name:
Antithrombin-III
Synonyms:
ANT3_HUMAN ATIII Antithrombin-III precursor SERPINC1
Type:
PROTEIN
Mol. Mass.:
52602.34
Organism:
Homo sapiens (Human)
Description:
ChEMBL_35871
Residue:
464
  
Inhibitor
Name:
BDBM50310300
Synonyms:
CHEMBL606451 US9120744, CDE-021
Type:
Small organic molecule
Emp. Form.:
C14H16N2O8S2
Mol. Mass.:
404.415
SMILES:
Oc1ccc(cc1O)S(=O)(=O)NCCNS(=O)(=O)c1ccc(O)c(O)c1
: