Target
Motilin receptor
Ligand
BDBM50311422
Substrate
Meas. Tech.
ChEMBL_622559 (CHEMBL1117503)
EC50
501.19±n/a nM
Citation
 Bailey, JMScott, JSBasilla, JBBolton, VJBoyfield, IEvans, DGFleury, EHeightman, TDJarvie, EMLawless, KMatthews, KLMcKay, FMok, HMuir, AOrlek, BSSanger, GJStemp, GStevens, AJThompson, MWard, JVaidya, KWestaway, SM The discovery and optimisation of benzazepine sulfonamide and sulfones as potent agonists of the motilin receptor. Bioorg Med Chem Lett 19:6452-8 (2009)  
Target
Name:
Motilin receptor
Synonyms:
G-protein coupled receptor 38 MLNR MTLR1 | MTLR_HUMAN
Type:
PROTEIN
Mol. Mass.:
45365.95
Organism:
Homo sapiens (Human)
Description:
ChEMBL_122664
Residue:
412
  
Inhibitor
Name:
BDBM50311422
Synonyms:
7-((6-(4-fluorophenoxy)pyridin-3-ylsulfonyl)methyl)-2,3,4,5-tetrahydro-1H-benzo[d]azepine | CHEMBL1078555
Type:
Small organic molecule
Emp. Form.:
C22H21FN2O3S
Mol. Mass.:
412.477
SMILES:
Fc1ccc(Oc2ccc(cn2)S(=O)(=O)Cc2ccc3CCNCCc3c2)cc1
: