Target
Peroxisome proliferator-activated receptor delta
Ligand
BDBM50312411
Substrate
Meas. Tech.
ChEMBL_620648 (CHEMBL1114856)
EC50
150±n/a nM
Citation
 Epple, RCow, CXie, YAzimioara, MRusso, RWang, XWityak, JKaranewsky, DSTuntland, TNguyêñ-Trân, VTCuc Ngo, CHuang, DSaez, ESpalding, TGerken, AIskandar, MSeidel, HMTian, SS Novel bisaryl substituted thiazoles and oxazoles as highly potent and selective peroxisome proliferator-activated receptor delta agonists. J Med Chem 53:77-105 (2010)  
Target
Name:
Peroxisome proliferator-activated receptor delta
Synonyms:
NR1C2 NUCI Nuclear receptor subfamily 1 group C member 2 PPAR-beta PPARD Peroxisome proliferator-activated receptor Peroxisome proliferator-activated receptor delta
Type:
Enzyme
Mol. Mass.:
49910.45
Organism:
Homo sapiens (Human)
Description:
Q03181
Residue:
441
  
Inhibitor
Name:
BDBM50312411
Synonyms:
2-(4-((4-(4-Methoxyphenyl)-5-(4-(trifluoromethylthio)phenyl)-thiazol-2-yl)methoxy)-2-methylphenoxy)acetic Acid | CHEMBL1081764
Type:
Small organic molecule
Emp. Form.:
C27H22F3NO5S2
Mol. Mass.:
561.592
SMILES:
COc1ccc(cc1)-c1nc(COc2ccc(OCC(O)=O)c(C)c2)sc1-c1ccc(SC(F)(F)F)cc1
: