Target
Peroxisome proliferator-activated receptor delta
Ligand
BDBM50312424
Substrate
Meas. Tech.
ChEMBL_620660 (CHEMBL1115681)
EC50
26±n/a nM
Citation
 Epple, RCow, CXie, YAzimioara, MRusso, RWang, XWityak, JKaranewsky, DSTuntland, TNguyêñ-Trân, VTCuc Ngo, CHuang, DSaez, ESpalding, TGerken, AIskandar, MSeidel, HMTian, SS Novel bisaryl substituted thiazoles and oxazoles as highly potent and selective peroxisome proliferator-activated receptor delta agonists. J Med Chem 53:77-105 (2010)  
Target
Name:
Peroxisome proliferator-activated receptor delta
Synonyms:
NUC1 Nuclear hormone receptor 1 PPAR-beta PPARD_MOUSE Ppard
Type:
PROTEIN
Mol. Mass.:
49719.14
Organism:
Mus musculus
Description:
ChEMBL_1288931
Residue:
440
  
Inhibitor
Name:
BDBM50312424
Synonyms:
CHEMBL1080349 | {4-[4-(4-Isopropoxyphenyl)-5-(4-trifluoromethoxyphenyl)thiazol-2-ylmethoxy]-2-methylphenoxy}acetic Acid
Type:
Small organic molecule
Emp. Form.:
C29H26F3NO6S
Mol. Mass.:
573.58
SMILES:
CC(C)Oc1ccc(cc1)-c1nc(COc2ccc(OCC(O)=O)c(C)c2)sc1-c1ccc(OC(F)(F)F)cc1
: