Target
Peroxisome proliferator-activated receptor gamma
Ligand
BDBM50312424
Substrate
Meas. Tech.
ChEMBL_620647 (CHEMBL1114855)
EC50
>10000±n/a nM
Citation
 Epple, RCow, CXie, YAzimioara, MRusso, RWang, XWityak, JKaranewsky, DSTuntland, TNguyêñ-Trân, VTCuc Ngo, CHuang, DSaez, ESpalding, TGerken, AIskandar, MSeidel, HMTian, SS Novel bisaryl substituted thiazoles and oxazoles as highly potent and selective peroxisome proliferator-activated receptor delta agonists. J Med Chem 53:77-105 (2010)  
Target
Name:
Peroxisome proliferator-activated receptor gamma
Synonyms:
NR1C3 PPAR-gamma PPARG_HUMAN Peroxisome proliferator-activated receptor gamma (PPAR gamma) Peroxisome proliferator-activated receptor gamma (PPARĪ³) peroxisome proliferator-activated receptor gamma isoform 2
Type:
Nuclear Receptor
Mol. Mass.:
57613.46
Organism:
Homo sapiens (Human)
Description:
P37231
Residue:
505
  
Inhibitor
Name:
BDBM50312424
Synonyms:
CHEMBL1080349 | {4-[4-(4-Isopropoxyphenyl)-5-(4-trifluoromethoxyphenyl)thiazol-2-ylmethoxy]-2-methylphenoxy}acetic Acid
Type:
Small organic molecule
Emp. Form.:
C29H26F3NO6S
Mol. Mass.:
573.58
SMILES:
CC(C)Oc1ccc(cc1)-c1nc(COc2ccc(OCC(O)=O)c(C)c2)sc1-c1ccc(OC(F)(F)F)cc1
: