Target
Peroxisome proliferator-activated receptor delta
Ligand
BDBM50312488
Substrate
Meas. Tech.
ChEMBL_620648 (CHEMBL1114856)
EC50
59±n/a nM
Citation
 Epple, RCow, CXie, YAzimioara, MRusso, RWang, XWityak, JKaranewsky, DSTuntland, TNguyêñ-Trân, VTCuc Ngo, CHuang, DSaez, ESpalding, TGerken, AIskandar, MSeidel, HMTian, SS Novel bisaryl substituted thiazoles and oxazoles as highly potent and selective peroxisome proliferator-activated receptor delta agonists. J Med Chem 53:77-105 (2010)  
Target
Name:
Peroxisome proliferator-activated receptor delta
Synonyms:
NR1C2 NUCI Nuclear receptor subfamily 1 group C member 2 PPAR-beta PPARD Peroxisome proliferator-activated receptor Peroxisome proliferator-activated receptor delta
Type:
Enzyme
Mol. Mass.:
49910.45
Organism:
Homo sapiens (Human)
Description:
Q03181
Residue:
441
  
Inhibitor
Name:
BDBM50312488
Synonyms:
2-(4-((4-(Pyrimidin-5-yl)-5-(4-(trifluoromethoxy)phenyl)thiazol-2-yl)methoxy)-2-methylphenoxy)acetic Acid | CHEMBL1079821
Type:
Small organic molecule
Emp. Form.:
C24H18F3N3O5S
Mol. Mass.:
517.477
SMILES:
Cc1cc(OCc2nc(c(s2)-c2ccc(OC(F)(F)F)cc2)-c2cncnc2)ccc1OCC(O)=O
: