Target
Peroxisome proliferator-activated receptor delta
Ligand
BDBM50312424
Substrate
Meas. Tech.
ChEMBL_620652 (CHEMBL1115673)
EC50
10±n/a nM
Citation
 Epple, RCow, CXie, YAzimioara, MRusso, RWang, XWityak, JKaranewsky, DSTuntland, TNguyêñ-Trân, VTCuc Ngo, CHuang, DSaez, ESpalding, TGerken, AIskandar, MSeidel, HMTian, SS Novel bisaryl substituted thiazoles and oxazoles as highly potent and selective peroxisome proliferator-activated receptor delta agonists. J Med Chem 53:77-105 (2010)  
Target
Name:
Peroxisome proliferator-activated receptor delta
Synonyms:
NR1C2 NUCI Nuclear receptor subfamily 1 group C member 2 PPAR-beta PPARD Peroxisome proliferator-activated receptor Peroxisome proliferator-activated receptor delta
Type:
Enzyme
Mol. Mass.:
49910.45
Organism:
Homo sapiens (Human)
Description:
Q03181
Residue:
441
  
Inhibitor
Name:
BDBM50312424
Synonyms:
CHEMBL1080349 | {4-[4-(4-Isopropoxyphenyl)-5-(4-trifluoromethoxyphenyl)thiazol-2-ylmethoxy]-2-methylphenoxy}acetic Acid
Type:
Small organic molecule
Emp. Form.:
C29H26F3NO6S
Mol. Mass.:
573.58
SMILES:
CC(C)Oc1ccc(cc1)-c1nc(COc2ccc(OCC(O)=O)c(C)c2)sc1-c1ccc(OC(F)(F)F)cc1
: