Target
Interstitial collagenase
Ligand
BDBM13080
Substrate
Meas. Tech.
ChEMBL_624092 (CHEMBL1103423)
IC50
300±n/a nM
Citation
 Nuti, ECasalini, FAvramova, SISantamaria, SFabbi, MFerrini, SMarinelli, LLa Pietra, VLimongelli, VNovellino, ECercignani, GOrlandini, ENencetti, SRossello, A Potent arylsulfonamide inhibitors of tumor necrosis factor-alpha converting enzyme able to reduce activated leukocyte cell adhesion molecule shedding in cancer cell models. J Med Chem 53:2622-35 (2010)  
Target
Name:
Interstitial collagenase
Synonyms:
CLG MMP1 Matrix metalloproteinase-1 | Matrix metalloproteinase-1 (MMP-1)
Type:
Enzyme
Mol. Mass.:
54010.26
Organism:
Homo sapiens (Human)
Description:
P03956
Residue:
469
  
Inhibitor
Name:
BDBM13080
Synonyms:
CGS 27023A Analog 3 US20230357139, Compound A | US20240050571, Compound NNGH
Type:
Small organic molecule
Emp. Form.:
C13H20N2O5S
Mol. Mass.:
316.373
SMILES:
COc1ccc(cc1)S(=O)(=O)N(CC(C)C)CC(=O)NO
: