Target
Interstitial collagenase
Ligand
BDBM50314228
Substrate
Meas. Tech.
ChEMBL_624092 (CHEMBL1103423)
IC50
56±n/a nM
Citation
 Nuti, ECasalini, FAvramova, SISantamaria, SFabbi, MFerrini, SMarinelli, LLa Pietra, VLimongelli, VNovellino, ECercignani, GOrlandini, ENencetti, SRossello, A Potent arylsulfonamide inhibitors of tumor necrosis factor-alpha converting enzyme able to reduce activated leukocyte cell adhesion molecule shedding in cancer cell models. J Med Chem 53:2622-35 (2010)  
Target
Name:
Interstitial collagenase
Synonyms:
CLG MMP1 Matrix metalloproteinase-1 | Matrix metalloproteinase-1 (MMP-1)
Type:
Enzyme
Mol. Mass.:
54010.26
Organism:
Homo sapiens (Human)
Description:
P03956
Residue:
469
  
Inhibitor
Name:
BDBM50314228
Synonyms:
(R)-N-hydroxy-2-(N-isobutyl-4-methoxyphenylsulfonamido)-3-methylbutanamide | CHEMBL1090284
Type:
Small organic molecule
Emp. Form.:
C16H26N2O5S
Mol. Mass.:
358.453
SMILES:
COc1ccc(cc1)S(=O)(=O)N(CC(C)C)[C@H](C(C)C)C(=O)NO
: