Target
72 kDa type IV collagenase
Ligand
BDBM50314228
Substrate
Meas. Tech.
ChEMBL_624093 (CHEMBL1103424)
IC50
29±n/a nM
Citation
 Nuti, ECasalini, FAvramova, SISantamaria, SFabbi, MFerrini, SMarinelli, LLa Pietra, VLimongelli, VNovellino, ECercignani, GOrlandini, ENencetti, SRossello, A Potent arylsulfonamide inhibitors of tumor necrosis factor-alpha converting enzyme able to reduce activated leukocyte cell adhesion molecule shedding in cancer cell models. J Med Chem 53:2622-35 (2010)  
Target
Name:
72 kDa type IV collagenase
Synonyms:
72 kDa gelatinase CLG4A Gelatinase A (MMP-2) MMP2_HUMAN Matrix metalloproteinase-2 (MMP 2) Matrix metalloproteinases 2 (MMP-2) | TBE-1
Type:
Enzyme
Mol. Mass.:
73870.36
Organism:
Homo sapiens (Human)
Description:
P08253
Residue:
660
  
Inhibitor
Name:
BDBM50314228
Synonyms:
(R)-N-hydroxy-2-(N-isobutyl-4-methoxyphenylsulfonamido)-3-methylbutanamide | CHEMBL1090284
Type:
Small organic molecule
Emp. Form.:
C16H26N2O5S
Mol. Mass.:
358.453
SMILES:
COc1ccc(cc1)S(=O)(=O)N(CC(C)C)[C@H](C(C)C)C(=O)NO
: