Target
Disintegrin and metalloproteinase domain-containing protein 17
Ligand
BDBM50314228
Substrate
Meas. Tech.
ChEMBL_624096 (CHEMBL1103427)
IC50
1100±n/a nM
Citation
 Nuti, ECasalini, FAvramova, SISantamaria, SFabbi, MFerrini, SMarinelli, LLa Pietra, VLimongelli, VNovellino, ECercignani, GOrlandini, ENencetti, SRossello, A Potent arylsulfonamide inhibitors of tumor necrosis factor-alpha converting enzyme able to reduce activated leukocyte cell adhesion molecule shedding in cancer cell models. J Med Chem 53:2622-35 (2010)  
Target
Name:
Disintegrin and metalloproteinase domain-containing protein 17
Synonyms:
ADA17_HUMAN CSVP Disintegrin and metalloproteinase domain-containing protein 17 (ADAM17) TNF-alpha convertase TNF-alpha-converting enzyme (TACE) Tumor necrosis factor-α converting enzyme (TACE)
Type:
Enzyme
Mol. Mass.:
93007.89
Organism:
Homo sapiens (Human)
Description:
Residue:
824
  
Inhibitor
Name:
BDBM50314228
Synonyms:
(R)-N-hydroxy-2-(N-isobutyl-4-methoxyphenylsulfonamido)-3-methylbutanamide | CHEMBL1090284
Type:
Small organic molecule
Emp. Form.:
C16H26N2O5S
Mol. Mass.:
358.453
SMILES:
COc1ccc(cc1)S(=O)(=O)N(CC(C)C)[C@H](C(C)C)C(=O)NO
: