Target
Serine/threonine-protein kinase mTOR
Ligand
BDBM50314365
Substrate
Meas. Tech.
ChEMBL_624367 (CHEMBL1107897)
IC50
1±n/a nM
Citation
 Tsou, HRMacEwan, GBirnberg, GGrosu, GBursavich, MGBard, JBrooijmans, NToral-Barza, LHollander, IMansour, TSAyral-Kaloustian, SYu, K Discovery and optimization of 2-(4-substituted-pyrrolo[2,3-b]pyridin-3-yl)methylene-4-hydroxybenzofuran-3(2H)-ones as potent and selective ATP-competitive inhibitors of the mammalian target of rapamycin (mTOR). Bioorg Med Chem Lett 20:2321-5 (2010)  
Target
Name:
Serine/threonine-protein kinase mTOR
Synonyms:
FK506-binding protein 12-rapamycin complex-associated protein 1 FRAP FRAP1 MTOR Mammalian Target of Rapamycin (mTOR) RAFT1 Rapamycin and FKBP12 target 1 Serine/threonine-protein kinase (mTOR) | mTORC2
Type:
Rapamycin target protein
Mol. Mass.:
288917.12
Organism:
Homo sapiens (Human)
Description:
P42345
Residue:
2549
  
Inhibitor
Name:
BDBM50314365
Synonyms:
4-hydroxy-2-((1-methyl-4-(4-(4-methylpiperazine-1-carbonyl)phenyl)-1H-pyrrolo[2,3-b]pyridin-3-yl)methylene)benzofuran-3(2H)-one | CHEMBL1092485
Type:
Small organic molecule
Emp. Form.:
C29H26N4O4
Mol. Mass.:
494.5411
SMILES:
CN1CCN(CC1)C(=O)c1ccc(cc1)-c1ccnc2n(C)cc(\C=C3/Oc4cccc(O)c4C3=O)c12
: