Target
Insulin-like growth factor 1 receptor
Ligand
BDBM50316777
Substrate
Meas. Tech.
ChEMBL_632812 (CHEMBL1111026)
IC50
1780±n/a nM
Citation
 Büttner, ACottin, TXu, JTzagkaroulaki, LGiannis, A Serotonin derivatives as a new class of non-ATP-competitive receptor tyrosine kinase inhibitors. Bioorg Med Chem 18:3387-402 (2010)  
Target
Name:
Insulin-like growth factor 1 receptor
Synonyms:
CD_antigen=CD221 IGF1R Insulin-like growth factor 1 receptor (IGF1R) Insulin-like growth factor 1 receptor alpha chain Insulin-like growth factor I receptor | Insulin-like growth factor receptor (IGFR)
Type:
Protein
Mol. Mass.:
154776.79
Organism:
Homo sapiens (Human)
Description:
P08069
Residue:
1367
  
Inhibitor
Name:
BDBM50316777
Synonyms:
2-[5-(4-Hydroxyphenethoxy)-1H-indole-3-yl]ethanamine hydrochloride | CHEMBL1095957
Type:
Small organic molecule
Emp. Form.:
C18H20N2O2
Mol. Mass.:
296.3636
SMILES:
NCCc1c[nH]c2ccc(OCCc3ccc(O)cc3)cc12
: