Target
Cytochrome P450 3A4
Ligand
BDBM50316937
Substrate
Meas. Tech.
ChEMBL_630096 (CHEMBL1110016)
IC50
>5000±n/a nM
Citation
 Lavrador-Erb, KRavula, SBYu, JZamani-Kord, SMoree, WJPetroski, REWen, JMalany, SHoare, SRMadan, ACrowe, PDBeaton, G The discovery and structure-activity relationships of 2-(piperidin-3-yl)-1H-benzimidazoles as selective, CNS penetrating H1-antihistamines for insomnia. Bioorg Med Chem Lett 20:2916-9 (2010)  
Target
Name:
Cytochrome P450 3A4
Synonyms:
Albendazole monooxygenase CP3A4_HUMAN CYP3A4 CYPIIIA4 Cytochrome P450 3A4 (CYP3A4) Nifedipine oxidase Taurochenodeoxycholate 6-alpha-hydroxylase
Type:
Enzyme
Mol. Mass.:
57349.57
Organism:
Homo sapiens (Human)
Description:
Residue:
503
  
Inhibitor
Name:
BDBM50316937
Synonyms:
1-(4-methoxybenzyl)-2-(1-methylpiperidin-3-yl)-1H-benzo[d]imidazole | CHEMBL1094509
Type:
Small organic molecule
Emp. Form.:
C21H25N3O
Mol. Mass.:
335.4427
SMILES:
COc1ccc(Cn2c(nc3ccccc23)C2CCCN(C)C2)cc1
: