Target
Potassium voltage-gated channel subfamily H member 2
Ligand
BDBM50316933
Substrate
Meas. Tech.
ChEMBL_630100 (CHEMBL1110020)
Ki
>10000±n/a nM
Citation
 Lavrador-Erb, KRavula, SBYu, JZamani-Kord, SMoree, WJPetroski, REWen, JMalany, SHoare, SRMadan, ACrowe, PDBeaton, G The discovery and structure-activity relationships of 2-(piperidin-3-yl)-1H-benzimidazoles as selective, CNS penetrating H1-antihistamines for insomnia. Bioorg Med Chem Lett 20:2916-9 (2010)  
Target
Name:
Potassium voltage-gated channel subfamily H member 2
Synonyms:
1,3-beta-glucan synthase component GLS2 ERG Eag-related protein 1 Ether-a-go-go-related gene (HERG) Ether-a-go-go-related gene potassium channel 1 Ether-a-go-go-related gene potassium channel 1 (hERG1) Ether-a-go-go-related protein 1 H-ERG KCNH2 Potassium voltage-gated channel subfamily H member 2 (hERG) Voltage-gated potassium channel subunit Kv11.1 hERG Potassium Channel 1 | putative potassium channel subunit
Type:
Multi-pass membrane protein
Mol. Mass.:
126672.65
Organism:
Homo sapiens (Human)
Description:
Q12809
Residue:
1159
  
Inhibitor
Name:
BDBM50316933
Synonyms:
4-methyl-2-((2-(1-methylpiperidin-3-yl)-1H-benzo[d]imidazol-1-yl)methyl)thiazole | CHEMBL1094512
Type:
Small organic molecule
Emp. Form.:
C18H22N4S
Mol. Mass.:
326.459
SMILES:
CN1CCCC(C1)c1nc2ccccc2n1Cc1nc(C)cs1
: