Target
Cholinesterase
Ligand
BDBM50317185
Substrate
Meas. Tech.
ChEMBL_631312 (CHEMBL1105649)
IC50
65±n/a nM
Citation
 Rook, YSchmidtke, KUGaube, FSchepmann, DWünsch, BHeilmann, JLehmann, JWinckler, T Bivalent beta-carbolines as potential multitarget anti-Alzheimer agents. J Med Chem 53:3611-7 (2010)  
Target
Name:
Cholinesterase
Synonyms:
BCHE CHLE_HORSE | Cholinesterase
Type:
Enzyme
Mol. Mass.:
65643.35
Organism:
Equus caballus (Horse)
Description:
P81908
Residue:
574
  
Inhibitor
Name:
BDBM50317185
Synonyms:
2-[7-(beta-Carboline-2-ium-2-yl)heptyl]-beta-carboline-2-ium dibromide | CHEMBL1088722
Type:
Small organic molecule
Emp. Form.:
C29H30N4
Mol. Mass.:
434.5742
SMILES:
C(CCC[n+]1ccc2c(c1)[nH]c1ccccc21)CCC[n+]1ccc2c(c1)[nH]c1ccccc21
: