Target
Proto-oncogene tyrosine-protein kinase Src
Ligand
BDBM50317243
Substrate
Meas. Tech.
ChEMBL_631357 (CHEMBL1105694)
IC50
62±n/a nM
Citation
 Boschelli, DHWang, DWang, YWu, BHonores, EEBarrios Sosa, ACChaudhary, IGolas, JLucas, JBoschelli, F Optimization of 7-alkene-3-quinolinecarbonitriles as Src kinase inhibitors. Bioorg Med Chem Lett 20:2924-7 (2010)  
Target
Name:
Proto-oncogene tyrosine-protein kinase Src
Synonyms:
Calmodulin/Proto-oncogene tyrosine-protein kinase Src Proto-oncogene c-Src SRC SRC_HUMAN V-src sarcoma (Schmidt-Ruppin A-2) viral oncogene homolog (avian) p60-Src | pp60c-src
Type:
Protein
Mol. Mass.:
59838.60
Organism:
Homo sapiens (Human)
Description:
P12931
Residue:
536
  
Inhibitor
Name:
BDBM50317243
Synonyms:
(E)-4-(2,4-dichloro-5-methoxyphenylamino)-7-(4-(dimethylamino)but-1-enyl)-6-methoxyquinoline-3-carbonitrile | CHEMBL1088241
Type:
Small organic molecule
Emp. Form.:
C24H24Cl2N4O2
Mol. Mass.:
471.379
SMILES:
COc1cc(Nc2c(cnc3cc(\C=C\CCN(C)C)c(OC)cc23)C#N)c(Cl)cc1Cl
: