Target
Adenosine receptor A1
Ligand
BDBM50317874
Substrate
Meas. Tech.
ChEMBL_630177 (CHEMBL1117280)
Ki
290±n/a nM
Citation
 Devine, SMGregg, AFigler, HMcIntosh, KUrmaliya, VLinden, JPouton, CWWhite, PJBottle, SEScammells, PJ Synthesis and evaluation of new N6-substituted adenosine-5'-N-methylcarboxamides as A3 adenosine receptor agonists. Bioorg Med Chem 18:3078-87 (2010)  
Target
Name:
Adenosine receptor A1
Synonyms:
A1 adenosine receptor (hA1) AA1R_HUMAN ADORA1 Adenosine A1-receptor Adenosine receptor A1 (hA1) | Adenosine transporter (AdT)
Type:
G Protein-Coupled Receptor (GPCR)
Mol. Mass.:
36520.92
Organism:
Homo sapiens (Human)
Description:
P30542
Residue:
326
  
Inhibitor
Name:
BDBM50317874
Synonyms:
(2R,3S,4R,5R)-2-(hydroxymethyl)-5-(6-(1,1,3,3-tetramethylisoindolin-5-ylamino)-1H-purin-9(6H)-yl)tetrahydrofuran-3,4-diol | CHEMBL1098183
Type:
Small organic molecule
Emp. Form.:
C22H30N6O4
Mol. Mass.:
442.5114
SMILES:
CC1(C)NC(C)(C)c2cc(NC3NC=Nc4c3ncn4[C@@H]3O[C@H](CO)[C@@H](O)[C@H]3O)ccc12
: