Target
Adenosine receptor A1
Ligand
BDBM50292322
Substrate
Meas. Tech.
ChEMBL_630177 (CHEMBL1117280)
Ki
50±n/a nM
Citation
 Devine, SMGregg, AFigler, HMcIntosh, KUrmaliya, VLinden, JPouton, CWWhite, PJBottle, SEScammells, PJ Synthesis and evaluation of new N6-substituted adenosine-5'-N-methylcarboxamides as A3 adenosine receptor agonists. Bioorg Med Chem 18:3078-87 (2010)  
Target
Name:
Adenosine receptor A1
Synonyms:
A1 adenosine receptor (hA1) AA1R_HUMAN ADORA1 Adenosine A1-receptor Adenosine receptor A1 (hA1) | Adenosine transporter (AdT)
Type:
G Protein-Coupled Receptor (GPCR)
Mol. Mass.:
36520.92
Organism:
Homo sapiens (Human)
Description:
P30542
Residue:
326
  
Inhibitor
Name:
BDBM50292322
Synonyms:
(2R,3R,4S,5R)-2-(6-((1-hydroxy-2,2,5,5-tetramethylpyrrolidin-3-yl)methylamino)-9H-purin-9-yl)-5-(hydroxymethyl)tetrahydrofuran-3,4-diol N6-(2,2,5,5-tetramethylpyrrolidin-1-yloxyl-3-ylmethyl)adenosine | VCP-28
Type:
Small organic molecule
Emp. Form.:
C19H29N6O5
Mol. Mass.:
421.4708
SMILES:
CC1(C)CC(CNc2ncnc3n(cnc23)[C@@H]2O[C@H](CO)[C@@H](O)[C@H]2O)C(C)(C)N1[O]
: