Target
Adenosine receptor A1
Ligand
BDBM50317888
Substrate
Meas. Tech.
ChEMBL_630177 (CHEMBL1117280)
Ki
26.2±n/a nM
Citation
 Devine, SMGregg, AFigler, HMcIntosh, KUrmaliya, VLinden, JPouton, CWWhite, PJBottle, SEScammells, PJ Synthesis and evaluation of new N6-substituted adenosine-5'-N-methylcarboxamides as A3 adenosine receptor agonists. Bioorg Med Chem 18:3078-87 (2010)  
Target
Name:
Adenosine receptor A1
Synonyms:
A1 adenosine receptor (hA1) AA1R_HUMAN ADORA1 Adenosine A1-receptor Adenosine receptor A1 (hA1) | Adenosine transporter (AdT)
Type:
G Protein-Coupled Receptor (GPCR)
Mol. Mass.:
36520.92
Organism:
Homo sapiens (Human)
Description:
P30542
Residue:
326
  
Inhibitor
Name:
BDBM50317888
Synonyms:
CHEMBL1094996 | N6-[4-[2-[3,4,5-Trimethoxybenzamido]ethyl]phenyl]adenosine-5'-N-methylcarboxamide
Type:
Small organic molecule
Emp. Form.:
C29H33N7O8
Mol. Mass.:
607.6144
SMILES:
CNC(=O)[C@H]1O[C@H]([C@H](O)[C@@H]1O)n1cnc2c(Nc3ccc(CCNC(=O)c4cc(OC)c(OC)c(OC)c4)cc3)ncnc12
: