Target
Adenosine receptor A2a
Ligand
BDBM50317882
Substrate
Meas. Tech.
ChEMBL_630178 (CHEMBL1117281)
Ki
>10000±n/a nM
Citation
 Devine, SMGregg, AFigler, HMcIntosh, KUrmaliya, VLinden, JPouton, CWWhite, PJBottle, SEScammells, PJ Synthesis and evaluation of new N6-substituted adenosine-5'-N-methylcarboxamides as A3 adenosine receptor agonists. Bioorg Med Chem 18:3078-87 (2010)  
Target
Name:
Adenosine receptor A2a
Synonyms:
A2A adenosine receptor (hA2A) ADENOSINE A2 ADORA2 Adenosine A2A receptor (A2AAR)
Type:
G Protein-Coupled Receptor (GPCR)
Mol. Mass.:
44716.46
Organism:
Homo sapiens (Human)
Description:
P29274
Residue:
412
  
Inhibitor
Name:
BDBM50317882
Synonyms:
CHEMBL1099128 | N6-(2,2,6,6-Tetramethylpiperidin-1-yloxyl-4-yl)adenosine-5'-N-methylcarboxamide
Type:
Small organic molecule
Emp. Form.:
C20H31N7O5
Mol. Mass.:
449.504
SMILES:
CNC(=O)[C@H]1O[C@H]([C@H](O)[C@@H]1O)n1cnc2c(NC3CC(C)(C)N(O)C(C)(C)C3)ncnc12
: