Target
Adenosine receptor A2a
Ligand
BDBM50317885
Substrate
Meas. Tech.
ChEMBL_630178 (CHEMBL1117281)
Ki
>10000±n/a nM
Citation
 Devine, SMGregg, AFigler, HMcIntosh, KUrmaliya, VLinden, JPouton, CWWhite, PJBottle, SEScammells, PJ Synthesis and evaluation of new N6-substituted adenosine-5'-N-methylcarboxamides as A3 adenosine receptor agonists. Bioorg Med Chem 18:3078-87 (2010)  
Target
Name:
Adenosine receptor A2a
Synonyms:
A2A adenosine receptor (hA2A) ADENOSINE A2 ADORA2 Adenosine A2A receptor (A2AAR)
Type:
G Protein-Coupled Receptor (GPCR)
Mol. Mass.:
44716.46
Organism:
Homo sapiens (Human)
Description:
P29274
Residue:
412
  
Inhibitor
Name:
BDBM50317885
Synonyms:
CHEMBL1098715 | N6-(3,5-Di-tert-butyl-4-hydroxyphenethyl)adenosine-5'-N-methylcarboxamide
Type:
Small organic molecule
Emp. Form.:
C27H38N6O5
Mol. Mass.:
526.6278
SMILES:
CNC(=O)[C@H]1O[C@H]([C@H](O)[C@@H]1O)n1cnc2c(NCCc3cc(c(O)c(c3)C(C)(C)C)C(C)(C)C)ncnc12
: