Target
Rho-associated protein kinase 1
Ligand
BDBM50319015
Substrate
Meas. Tech.
ChEMBL_635489 (CHEMBL1117723)
EC50
>10000±n/a nM
Citation
 Davis, RLKahraman, MPrins, TJBeaver, YCook, TGCramp, JCayanan, CSGardiner, EMMcLaughlin, MAClark, AFHellberg, MRShiau, AKNoble, SABorchardt, AJ Benzothiophene containing Rho kinase inhibitors: Efficacy in an animal model of glaucoma. Bioorg Med Chem Lett 20:3361-6 (2010)  
Target
Name:
Rho-associated protein kinase 1
Synonyms:
ROCK-I ROCK1_HUMAN Rho-associated protein kinase Rho-associated, coiled-coil-containing protein kinase 1 Rho-kinase (ROCK I) p160 ROCK-1 | p160ROCK
Type:
Serine/threonine-protein kinase
Mol. Mass.:
158156.77
Organism:
Homo sapiens (Human)
Description:
Q13464
Residue:
1354
  
Inhibitor
Name:
BDBM50319015
Synonyms:
4-(3-methyl-5-phenylbenzo[b]thiophen-2-yl)pyrimidin-2-amine | CHEMBL1085706
Type:
Small organic molecule
Emp. Form.:
C19H15N3S
Mol. Mass.:
317.408
SMILES:
Cc1c(sc2ccc(cc12)-c1ccccc1)-c1ccnc(N)n1
: