Target
Aurora kinase A
Ligand
BDBM50319616
Substrate
Meas. Tech.
ChEMBL_634451 (CHEMBL1119477)
Ki
7.6±n/a nM
Citation
 Wang, SMidgley, CAScaërou, FGrabarek, JBGriffiths, GJackson, WKontopidis, GMcClue, SJMcInnes, CMeades, CMezna, MPlater, AStuart, IThomas, MPWood, GClarke, RGBlake, DGZheleva, DILane, DPJackson, RCGlover, DMFischer, PM Discovery of N-phenyl-4-(thiazol-5-yl)pyrimidin-2-amine aurora kinase inhibitors. J Med Chem 53:4367-78 (2010)  
Target
Name:
Aurora kinase A
Synonyms:
AIK ARK-1 AURA AURKA_HUMAN Aurora 2 Aurora kinase A (AURKA) Aurora kinase A (Aurora-2) Aurora/IPL1-related kinase 1 Breast tumor-amplified kinase IAK1 STK15 GN Serine/threonine kinase 15 Serine/threonine-protein kinase 6 Serine/threonine-protein kinase aurora-A aurora-2 | hARK1
Type:
Serine/threonine-protein kinase
Mol. Mass.:
45830.98
Organism:
Homo sapiens (Human)
Description:
O14965
Residue:
403
  
Inhibitor
Name:
BDBM50319616
Synonyms:
1-(4-(4-(4-(2-Amino-4-methylthiazol-5-yl)pyrimidin-2-ylamino)phenyl)piperazin-1-yl)ethanone | CHEMBL1084969
Type:
Small organic molecule
Emp. Form.:
C20H23N7OS
Mol. Mass.:
409.508
SMILES:
CC(=O)N1CCN(CC1)c1ccc(Nc2nccc(n2)-c2sc(N)nc2C)cc1
: