Target
Aurora kinase A
Ligand
BDBM50319617
Substrate
Meas. Tech.
ChEMBL_634451 (CHEMBL1119477)
Ki
14±n/a nM
Citation
 Wang, SMidgley, CAScaërou, FGrabarek, JBGriffiths, GJackson, WKontopidis, GMcClue, SJMcInnes, CMeades, CMezna, MPlater, AStuart, IThomas, MPWood, GClarke, RGBlake, DGZheleva, DILane, DPJackson, RCGlover, DMFischer, PM Discovery of N-phenyl-4-(thiazol-5-yl)pyrimidin-2-amine aurora kinase inhibitors. J Med Chem 53:4367-78 (2010)  
Target
Name:
Aurora kinase A
Synonyms:
AIK ARK-1 AURA AURKA_HUMAN Aurora 2 Aurora kinase A (AURKA) Aurora kinase A (Aurora-2) Aurora/IPL1-related kinase 1 Breast tumor-amplified kinase IAK1 STK15 GN Serine/threonine kinase 15 Serine/threonine-protein kinase 6 Serine/threonine-protein kinase aurora-A aurora-2 | hARK1
Type:
Serine/threonine-protein kinase
Mol. Mass.:
45830.98
Organism:
Homo sapiens (Human)
Description:
O14965
Residue:
403
  
Inhibitor
Name:
BDBM50319617
Synonyms:
CHEMBL1084630 | N-Ethyl-4-methyl-5-(2-(4-morpholinophenylamino)pyrimidin-4-yl)thiazol-2-amine
Type:
Small organic molecule
Emp. Form.:
C20H24N6OS
Mol. Mass.:
396.509
SMILES:
CCNc1nc(C)c(s1)-c1ccnc(Nc2ccc(cc2)N2CCOCC2)n1
: