Target
Aurora kinase A
Ligand
BDBM50229973
Substrate
Meas. Tech.
ChEMBL_634451 (CHEMBL1119477)
Ki
73±n/a nM
Citation
 Wang, SMidgley, CAScaërou, FGrabarek, JBGriffiths, GJackson, WKontopidis, GMcClue, SJMcInnes, CMeades, CMezna, MPlater, AStuart, IThomas, MPWood, GClarke, RGBlake, DGZheleva, DILane, DPJackson, RCGlover, DMFischer, PM Discovery of N-phenyl-4-(thiazol-5-yl)pyrimidin-2-amine aurora kinase inhibitors. J Med Chem 53:4367-78 (2010)  
Target
Name:
Aurora kinase A
Synonyms:
AIK ARK-1 AURA AURKA_HUMAN Aurora 2 Aurora kinase A (AURKA) Aurora kinase A (Aurora-2) Aurora/IPL1-related kinase 1 Breast tumor-amplified kinase IAK1 STK15 GN Serine/threonine kinase 15 Serine/threonine-protein kinase 6 Serine/threonine-protein kinase aurora-A aurora-2 | hARK1
Type:
Serine/threonine-protein kinase
Mol. Mass.:
45830.98
Organism:
Homo sapiens (Human)
Description:
O14965
Residue:
403
  
Inhibitor
Name:
BDBM50229973
Synonyms:
(4-(2-Amino-4-methylthiazol-5-yl)pyrimidin-2-yl)-(3-nitrophenyl)amine CHEMBL298445 | [4-(2-AMINO-4-METHYL-THIAZOL-5-YL)-PYRIMIDIN-2-YL]-(3-NITRO-PHENYL)-AMINE
Type:
Small organic molecule
Emp. Form.:
C14H12N6O2S
Mol. Mass.:
328.349
SMILES:
Cc1nc(N)sc1-c1ccnc(Nc2cccc(c2)[N+]([O-])=O)n1
: