Target
Cyclin-dependent kinase 9
Ligand
BDBM50319622
Substrate
Meas. Tech.
ChEMBL_634458 (CHEMBL1119484)
Ki
6±n/a nM
Citation
 Wang, SMidgley, CAScaërou, FGrabarek, JBGriffiths, GJackson, WKontopidis, GMcClue, SJMcInnes, CMeades, CMezna, MPlater, AStuart, IThomas, MPWood, GClarke, RGBlake, DGZheleva, DILane, DPJackson, RCGlover, DMFischer, PM Discovery of N-phenyl-4-(thiazol-5-yl)pyrimidin-2-amine aurora kinase inhibitors. J Med Chem 53:4367-78 (2010)  
Target
Name:
Cyclin-dependent kinase 9
Synonyms:
C-2K CDK9 Cell division cycle 2-like protein kinase 4 Cyclin-Dependent Kinase 9 (CDK9) Serine/threonine-protein kinase PITALRE Tat-associated kinase complex catalytic subunit
Type:
Enzyme Subunit
Mol. Mass.:
42789.13
Organism:
Homo sapiens (Human)
Description:
Residue:
372
  
Inhibitor
Name:
BDBM50319622
Synonyms:
CHEMBL1083152 | N,4-Dimethyl-5-(2-(3,4,5-trimethoxyphenylamino)pyrimidin-4-yl)thiazol-2-amine
Type:
Small organic molecule
Emp. Form.:
C18H21N5O3S
Mol. Mass.:
387.456
SMILES:
CNc1nc(C)c(s1)-c1ccnc(Nc2cc(OC)c(OC)c(OC)c2)n1
: