Target
Cyclin-dependent kinase 4
Ligand
BDBM50319617
Substrate
Meas. Tech.
ChEMBL_634456 (CHEMBL1119482)
Ki
196±n/a nM
Citation
 Wang, SMidgley, CAScaërou, FGrabarek, JBGriffiths, GJackson, WKontopidis, GMcClue, SJMcInnes, CMeades, CMezna, MPlater, AStuart, IThomas, MPWood, GClarke, RGBlake, DGZheleva, DILane, DPJackson, RCGlover, DMFischer, PM Discovery of N-phenyl-4-(thiazol-5-yl)pyrimidin-2-amine aurora kinase inhibitors. J Med Chem 53:4367-78 (2010)  
Target
Name:
Cyclin-dependent kinase 4
Synonyms:
CDK4 Cell division protein kinase 4 PSK-J3
Type:
Enzyme Subunit
Mol. Mass.:
33731.96
Organism:
Homo sapiens (Human)
Description:
P11802
Residue:
303
  
Inhibitor
Name:
BDBM50319617
Synonyms:
CHEMBL1084630 | N-Ethyl-4-methyl-5-(2-(4-morpholinophenylamino)pyrimidin-4-yl)thiazol-2-amine
Type:
Small organic molecule
Emp. Form.:
C20H24N6OS
Mol. Mass.:
396.509
SMILES:
CCNc1nc(C)c(s1)-c1ccnc(Nc2ccc(cc2)N2CCOCC2)n1
: