Target
Cathepsin S
Ligand
BDBM50323264
Substrate
Meas. Tech.
ChEMBL_643889 (CHEMBL1211788)
IC50
37±n/a nM
Citation
 Cai, JBaugh, MBlack, DLong, CJonathan Bennett, DDempster, MFradera, XGillespie, JAndrews, FBoucharens, SBruin, JCameron, KSCumming, IHamilton, WJones, PSKaptein, AKinghorn, EMaidment, MMartin, IMitchell, ARankovic, ZRobinson, JScullion, PUitdehaag, JCVink, PWestwood, Pvan Zeeland, Mvan Berkom, LBastiani, MMeulemans, T 6-Phenyl-1H-imidazo[4,5-c]pyridine-4-carbonitrile as cathepsin S inhibitors. Bioorg Med Chem Lett 20:4350-4 (2010)  
Target
Name:
Cathepsin S
Synonyms:
CATS_HUMAN Cathepsin S (Cat S) | cathepsin S preproprotein
Type:
Protein
Mol. Mass.:
37507.38
Organism:
Homo sapiens (Human)
Description:
P25774
Residue:
331
  
Inhibitor
Name:
BDBM50323264
Synonyms:
6-(4-ethoxy-3-(trifluoromethyl)phenyl)-1-(2-morpholinoethyl)-1H-imidazo[4,5-c]pyridine-4-carbonitrile | CHEMBL1208848
Type:
Small organic molecule
Emp. Form.:
C22H22F3N5O2
Mol. Mass.:
445.4376
SMILES:
CCOc1ccc(cc1C(F)(F)F)-c1cc2n(CCN3CCOCC3)cnc2c(n1)C#N
: