Target
Metabotropic glutamate receptor 5
Ligand
BDBM50323275
Substrate
Meas. Tech.
ChEMBL_643901 (CHEMBL1211800)
IC50
347±n/a nM
Citation
 Felts, ASLindsley, SRLamb, JPRodriguez, ALMenon, UNJadhav, SJones, CKConn, PJLindsley, CWEmmitte, KA 3-Cyano-5-fluoro-N-arylbenzamides as negative allosteric modulators of mGlu(5): Identification of easily prepared tool compounds with CNS exposure in rats. Bioorg Med Chem Lett 20:4390-4 (2010)  
Target
Name:
Metabotropic glutamate receptor 5
Synonyms:
GRM5_RAT Grm5 Mglur5 metabotropic glutamate 5/1-C metabotropic glutamate 5a
Type:
Enzyme
Mol. Mass.:
131900.14
Organism:
Rattus norvegicus (Rat)
Description:
P31424
Residue:
1203
  
Inhibitor
Name:
BDBM50323275
Synonyms:
CHEMBL1209618 | N-(3-chloro-2-fluorophenyl)-3-cyano-5-fluorobenzamide
Type:
Small organic molecule
Emp. Form.:
C14H7ClF2N2O
Mol. Mass.:
292.668
SMILES:
Fc1cc(cc(c1)C(=O)Nc1cccc(Cl)c1F)C#N
: